{"text_format":"1","workbook":"xlsx","n_sheets":2,"sheets":["Table 1","Sheet1"],"not_rendered":{"charts":0,"images":0,"macros":1,"external_links":0,"defined_names":0,"comments":0,"pivot_tables":0},"unopened":[],"bounds":{"document_bytes":16777216,"sheet_cells":100000,"rows_first":2000,"rows_last":500,"rows_between":2000,"halvings":0,"cell_chars":16384,"cell_head_chars":4096},"cells_cut":0,"cells_raw":0,"read":"whole","date_system":"1900"}

{"sheet":"Table 1","index":0,"n_rows":97,"n_cols":35,"rows_kept":97,"cut":false,"hidden":false,"merged":[[96,0,96,34],[93,0,93,6],[93,7,93,13],[93,14,93,19],[93,20,93,34],[94,0,95,0],[94,1,94,4],[94,5,95,9],[94,10,95,11],[94,12,95,14],[94,15,95,15],[94,16,95,17],[94,18,95,20],[94,21,95,22],[94,23,95,25],[94,26,95,28],[94,29,95,29],[94,30,95,31],[94,32,95,32],[94,33,94,34],[95,1,95,4],[95,33,95,34],[89,0,89,34],[90,0,90,34],[91,0,91,6],[91,7,91,13],[91,14,91,19],[91,20,91,27],[91,28,91,30],[91,31,91,34],[92,0,92,6],[92,7,92,13],[92,14,92,19],[92,20,92,34],[87,26,87,28],[87,30,87,31],[87,32,88,32],[87,33,87,34],[88,1,88,4],[88,10,88,11],[88,12,88,14],[88,16,88,17],[88,18,88,20],[88,21,88,22],[88,23,88,25],[88,26,88,28],[88,30,88,31],[87,0,88,0],[87,1,87,4],[87,5,88,9],[87,10,87,11],[87,12,87,14],[87,16,87,17],[87,18,87,20],[87,21,87,22],[87,23,87,25],[85,26,85,28],[85,30,85,31],[85,32,86,32],[85,33,85,34],[86,1,86,4],[86,10,86,11],[86,12,86,14],[86,16,86,17],[86,18,86,20],[86,21,86,22],[86,23,86,25],[86,26,86,28],[86,30,86,31],[85,0,86,0],[85,1,85,4],[85,5,86,9],[85,10,85,11],[85,12,85,14],[85,16,85,17],[85,18,85,20],[85,21,85,22],[85,23,85,25],[83,26,83,28],[83,30,83,31],[83,32,84,32],[83,33,83,34],[84,1,84,4],[84,10,84,11],[84,12,84,14],[84,16,84,17],[84,18,84,20],[84,21,84,22],[84,23,84,25],[84,26,84,28],[84,30,84,31],[83,0,84,0],[83,1,83,4],[83,5,84,9],[83,10,83,11],[83,12,83,14],[83,16,83,17],[83,18,83,20],[83,21,83,22],[83,23,83,25],[81,26,81,28],[81,30,81,31],[81,32,82,32],[81,33,81,34],[82,1,82,4],[82,10,82,11],[82,12,82,14],[82,16,82,17],[82,18,82,20],[82,21,82,22],[82,23,82,25],[82,26,82,28],[82,30,82,31],[81,0,82,0],[81,1,81,4],[81,5,82,9],[81,10,81,11],[81,12,81,14],[81,16,81,17],[81,18,81,20],[81,21,81,22],[81,23,81,25],[79,26,79,28],[79,30,79,31],[79,32,80,32],[79,33,79,34],[80,1,80,4],[80,10,80,11],[80,12,80,14],[80,16,80,17],[80,18,80,20],[80,21,80,22],[80,23,80,25],[80,26,80,28],[80,30,80,31],[79,0,80,0],[79,1,79,4],[79,5,80,9],[79,10,79,11],[79,12,79,14],[79,16,79,17],[79,18,79,20],[79,21,79,22],[79,23,79,25],[77,26,77,28],[77,30,77,31],[77,32,78,32],[77,33,77,34],[78,1,78,4],[78,10,78,11],[78,12,78,14],[78,16,78,17],[78,18,78,20],[78,21,78,22],[78,23,78,25],[78,26,78,28],[78,30,78,31],[77,0,78,0],[77,1,77,4],[77,5,78,9],[77,10,77,11],[77,12,77,14],[77,16,77,17],[77,18,77,20],[77,21,77,22],[77,23,77,25],[75,26,75,28],[75,30,75,31],[75,32,76,32],[75,33,75,34],[76,1,76,4],[76,10,76,11],[76,12,76,14],[76,16,76,17],[76,18,76,20],[76,21,76,22],[76,23,76,25],[76,26,76,28],[76,30,76,31],[75,0,76,0],[75,1,75,4],[75,5,76,9],[75,10,75,11],[75,12,75,14],[75,16,75,17],[75,18,75,20],[75,21,75,22],[75,23,75,25],[73,26,73,28],[73,30,73,31],[73,32,74,32],[73,33,73,34],[74,1,74,4],[74,10,74,11],[74,12,74,14],[74,16,74,17],[74,18,74,20],[74,21,74,22],[74,23,74,25],[74,26,74,28],[74,30,74,31],[73,0,74,0],[73,1,73,4],[73,5,74,9],[73,10,73,11],[73,12,73,14],[73,16,73,17],[73,18,73,20],[73,21,73,22],[73,23,73,25],[71,26,71,28],[71,30,71,31],[71,32,72,32],[71,33,71,34],[72,1,72,4],[72,10,72,11],[72,12,72,14],[72,16,72,17],[72,18,72,20],[72,21,72,22],[72,23,72,25],[72,26,72,28],[72,30,72,31],[71,0,72,0],[71,1,71,4],[71,5,72,9],[71,10,71,11],[71,12,71,14],[71,16,71,17],[71,18,71,20],[71,21,71,22],[71,23,71,25],[69,26,69,28],[69,30,69,31],[69,32,70,32],[69,33,69,34],[70,1,70,4],[70,10,70,11],[70,12,70,14],[70,16,70,17],[70,18,70,20],[70,21,70,22],[70,23,70,25],[70,26,70,28],[70,30,70,31],[69,0,70,0],[69,1,69,4],[69,5,70,9],[69,10,69,11],[69,12,69,14],[69,16,69,17],[69,18,69,20],[69,21,69,22],[69,23,69,25],[66,0,66,6],[66,7,66,13],[66,14,66,19],[66,20,66,34],[67,0,68,0],[67,1,67,4],[67,5,68,9],[67,10,68,11],[67,12,68,14],[67,15,68,15],[67,16,68,17],[67,18,68,20],[67,21,68,22],[67,23,68,25],[67,26,68,28],[67,29,68,29],[67,30,68,31],[67,32,68,32],[67,33,67,34],[68,1,68,4],[68,33,68,34],[62,0,62,34],[63,0,63,34],[64,0,64,6],[64,7,64,13],[64,14,64,19],[64,20,64,27],[64,28,64,30],[64,31,64,34],[65,0,65,6],[65,7,65,13],[65,14,65,19],[65,20,65,34],[60,26,60,28],[60,30,60,31],[60,32,61,32],[60,33,60,34],[61,1,61,4],[61,10,61,11],[61,12,61,14],[61,16,61,17],[61,18,61,20],[61,21,61,22],[61,23,61,25],[61,26,61,28],[61,30,61,31],[60,0,61,0],[60,1,60,4],[60,5,61,9],[60,10,60,11],[60,12,60,14],[60,16,60,17],[60,18,60,20],[60,21,60,22],[60,23,60,25],[58,26,58,28],[58,30,58,31],[58,32,59,32],[58,33,58,34],[59,1,59,4],[59,10,59,11],[59,12,59,14],[59,16,59,17],[59,18,59,20],[59,21,59,22],[59,23,59,25],[59,26,59,28],[59,30,59,31],[58,0,59,0],[58,1,58,4],[58,5,59,9],[58,10,58,11],[58,12,58,14],[58,16,58,17],[58,18,58,20],[58,21,58,22],[58,23,58,25],[56,26,56,28],[56,30,56,31],[56,32,57,32],[56,33,56,34],[57,1,57,4],[57,10,57,11],[57,12,57,14],[57,16,57,17],[57,18,57,20],[57,21,57,22],[57,23,57,25],[57,26,57,28],[57,30,57,31],[56,0,57,0],[56,1,56,4],[56,5,57,9],[56,10,56,11],[56,12,56,14],[56,16,56,17],[56,18,56,20],[56,21,56,22],[56,23,56,25],[54,26,54,28],[54,30,54,31],[54,32,55,32],[54,33,54,34],[55,1,55,4],[55,10,55,11],[55,12,55,14],[55,16,55,17],[55,18,55,20],[55,21,55,22],[55,23,55,25],[55,26,55,28],[55,30,55,31],[54,0,55,0],[54,1,54,4],[54,5,55,9],[54,10,54,11],[54,12,54,14],[54,16,54,17],[54,18,54,20],[54,21,54,22],[54,23,54,25],[52,26,52,28],[52,30,52,31],[52,32,53,32],[52,33,52,34],[53,1,53,4],[53,10,53,11],[53,12,53,14],[53,16,53,17],[53,18,53,20],[53,21,53,22],[53,23,53,25],[53,26,53,28],[53,30,53,31],[52,0,53,0],[52,1,52,4],[52,5,53,9],[52,10,52,11],[52,12,52,14],[52,16,52,17],[52,18,52,20],[52,21,52,22],[52,23,52,25],[50,26,50,28],[50,30,50,31],[50,32,51,32],[50,33,50,34],[51,1,51,4],[51,10,51,11],[51,12,51,14],[51,16,51,17],[51,18,51,20],[51,21,51,22],[51,23,51,25],[51,26,51,28],[51,30,51,31],[50,0,51,0],[50,1,50,4],[50,5,51,9],[50,10,50,11],[50,12,50,14],[50,16,50,17],[50,18,50,20],[50,21,50,22],[50,23,50,25],[48,26,48,28],[48,30,48,31],[48,32,49,32],[48,33,48,34],[49,1,49,4],[49,10,49,11],[49,12,49,14],[49,16,49,17],[49,18,49,20],[49,21,49,22],[49,23,49,25],[49,26,49,28],[49,30,49,31],[48,0,49,0],[48,1,48,4],[48,5,49,9],[48,10,48,11],[48,12,48,14],[48,16,48,17],[48,18,48,20],[48,21,48,22],[48,23,48,25],[46,26,46,28],[46,30,46,31],[46,32,47,32],[46,33,46,34],[47,1,47,4],[47,10,47,11],[47,12,47,14],[47,16,47,17],[47,18,47,20],[47,21,47,22],[47,23,47,25],[47,26,47,28],[47,30,47,31],[46,0,47,0],[46,1,46,4],[46,5,47,9],[46,10,46,11],[46,12,46,14],[46,16,46,17],[46,18,46,20],[46,21,46,22],[46,23,46,25],[44,26,44,28],[44,30,44,31],[44,32,45,32],[44,33,44,34],[45,1,45,4],[45,10,45,11],[45,12,45,14],[45,16,45,17],[45,18,45,20],[45,21,45,22],[45,23,45,25],[45,26,45,28],[45,30,45,31],[44,0,45,0],[44,1,44,4],[44,5,45,9],[44,10,44,11],[44,12,44,14],[44,16,44,17],[44,18,44,20],[44,21,44,22],[44,23,44,25],[41,33,41,34],[42,0,43,0],[42,1,42,4],[42,5,43,9],[42,10,42,11],[42,12,42,14],[42,16,42,17],[42,18,42,20],[42,21,42,22],[42,23,42,25],[42,26,42,28],[42,30,42,31],[42,32,43,32],[42,33,42,34],[43,1,43,4],[43,10,43,11],[43,12,43,14],[43,16,43,17],[43,18,43,20],[43,21,43,22],[43,23,43,25],[43,26,43,28],[43,30,43,31],[38,0,38,6],[38,7,38,13],[38,14,38,19],[38,20,38,34],[39,0,39,6],[39,7,39,13],[39,14,39,19],[39,20,39,34],[40,0,41,0],[40,1,40,4],[40,5,41,9],[40,10,41,11],[40,12,41,14],[40,15,41,15],[40,16,41,17],[40,18,41,20],[40,21,41,22],[40,23,41,25],[40,26,41,28],[40,29,41,29],[40,30,41,31],[40,32,41,32],[40,33,40,34],[41,1,41,4],[34,0,34,2],[34,3,34,7],[34,8,34,13],[34,14,34,17],[34,18,34,23],[36,0,36,34],[37,0,37,6],[37,7,37,13],[37,14,37,19],[37,20,37,27],[37,28,37,30],[37,31,37,34],[32,0,32,2],[32,3,32,7],[32,8,32,13],[32,14,32,17],[32,18,32,23],[33,0,33,2],[33,3,33,7],[33,8,33,13],[33,14,33,17],[33,18,33,23],[29,0,29,5],[29,6,29,12],[29,13,29,18],[29,19,29,26],[30,0,30,5],[30,6,30,12],[30,13,30,18],[30,19,30,26],[31,0,31,2],[31,3,31,7],[31,8,31,13],[31,14,31,17],[31,18,31,23],[27,0,27,5],[27,6,27,10],[27,11,27,12],[27,13,27,18],[27,19,27,24],[27,25,27,26],[28,0,28,5],[28,6,28,10],[28,11,28,12],[28,13,28,18],[28,19,28,24],[28,25,28,26],[6,0,6,1],[6,2,6,8],[6,9,6,16],[6,17,6,26],[7,0,7,1],[7,2,7,8],[7,9,7,16],[7,17,7,26],[26,0,26,5],[26,6,26,10],[26,11,26,12],[26,13,26,18],[26,19,26,24],[26,25,26,26],[3,0,3,3],[3,4,3,8],[3,9,3,12],[3,13,3,16],[3,17,3,21],[3,22,3,26],[4,0,4,26],[5,0,5,1],[5,2,5,8],[5,9,5,16],[5,17,5,26],[1,0,1,3],[1,4,1,8],[1,9,1,12],[1,13,1,16],[1,17,1,21],[1,22,1,26],[2,0,2,3],[2,4,2,8],[2,9,2,12],[2,13,2,16],[2,17,2,21],[2,22,2,26]]}
["사업장 고지( 산 출) 내역서 - 건강보험 "]
["작성일차수",null,null,null,"2015/03/17-01",null,null,null,null,"고지년월",null,null,null,"2015년 03월",null,null,null,"통합납부자번호"]
["사업장관리번호",null,null,null,null,null,null,null,null,"사업장명"]
["전자납부번호",null,null,null,null,null,null,null,null,"고지차수",null,null,null,1,null,null,null,"회계코드",null,null,null,null,0]
["당월 분  산 출 내 역"]
["구",null,"분",null,null,null,null,null,null,"건 강 보 험 료",null,null,null,null,null,null,null,"장 기 요 양 보 험 료"]
["①",null,"산출 보험 료",null,null,null,null,null,null,1183180,null,null,null,null,null,null,null,77390]
["②",null,"정산 보험 료",null,null,null,null,null,null,277440,null,null,null,null,null,null,null,18170]
["③  가입 자보 험료 "]
["( ① + ② )                                                 1,460,620                                      95,560"]
["④  사용 자보 험료                                          1,460,620                                      95,560"]
["⑤  선납 보험 료                                                          0                                              0"]
["⑥  환급 금이 자                                                          0                                              0"]
["⑦고 지보 험료 "]
["(③ +④ +⑤ +⑥ )                                            2,921,240                                     191,120"]
["납부 할보 험 료"]
["(건 강+ 장기 요양 )                                                                                            3,112,360"]
["고지 인원                                                                                                          20 명"]
["당월 분  고 지 내 역"]
["고   지   월                   2015년 03월분                    납부기한                  2015년 04월 10일 보험료(계)                                       건강                                           요양"]
["3,112,360                                  2,921,240                                    191,120"]
["납기 후 보험료                                    건강                                           요양"]
["3,205,720                                  3,008,870                                    196,850"]
["납기 후 기한                                                    2015년 05월 10일"]
["전월 납부 내 역  및  체 납내 역"]
["고   지   월                   2015년 02월분"]
["구          분",null,null,null,null,null,"계",null,null,null,null,null,null,"건강",null,null,null,null,null,"요양"]
["납부보험료",null,null,null,null,null,null,null,null,null,null,2612040,null,2451640,null,null,null,null,null,null,null,null,null,null,null,160400]
["체납 총 보험료",null,null,null,null,null,null,null,null,null,null,0,null,0,null,null,null,null,null,null,null,null,null,null,null,0]
["건강체납기간",null,null,null,null,null,"건강체납개월수",null,null,null,null,null,null,"요양체납기간",null,null,null,null,null,"요양체납개월수"]
[null,null,null,null,null,null,"개월",null,null,null,null,null,null,null,null,null,null,null,null,"개월"]
["은행명",null,null,"기업",null,null,null,null,"국민",null,null,null,null,null,"우체국",null,null,null,"NH농협"]
["계좌번호"]
["은행명",null,null,"신한",null,null,null,null,"우리",null,null,null,null,null,"대구",null,null,null,"하나"]
["계좌번호"]
["입금전용 계좌"]
["개인별 보험료 고지(산출)내역서 - 건강보험"]
["작  성  일",null,null,null,null,null,null,"2015년 03월 17일",null,null,null,null,null,null,"사업장관리번호",null,null,null,null,null,null,null,null,null,null,null,null,null,"단위사업장기호",null,null,0]
["통 보 년 월",null,null,null,null,null,null,"2015년 03월 1차",null,null,null,null,null,null,"사 업 장 명"]
["전자납부번호",null,null,null,null,null,null,null,null,null,null,null,null,null,"단위사업장명",null,null,null,null,null,"NONE"]
["성명","증번호",null,null,null,"보수월액",null,null,null,null,"구 분",null,"산출보험료",null,null,"사 유","적용기간",null,"정산금액",null,null,"감 면",null,"연말정산 보 험 료",null,null,"고지금액",null,null,"환급금 이  자","고지+이자 합     계",null,"총  계 (건강+요양)","단위기관"]
[null,"주민등록번호",null,null,null,null,null,null,null,null,null,null,null,null,null,null,null,null,null,null,null,null,null,null,null,null,null,null,null,null,null,null,null,"회계/직종"]
["홍길동1",null,null,null,null,1898620,null,null,null,null,"건강",null,57620,null,null,null,null,null,0,null,null,null,null,0,null,null,57620,null,null,0,57620,null,61390,0]
[null,null,null,null,null,null,null,null,null,null,"요양",null,3770,null,null,null,null,null,0,null,null,null,null,0,null,null,3770,null,null,0,3770,null,null,0,0]
["홍길동2",null,null,null,null,1254907,null,null,null,null,"건강",null,38080,null,null,null,null,null,0,null,null,null,null,0,null,null,38080,null,null,0,38080,null,40570,0]
[null,null,null,null,null,null,null,null,null,null,"요양",null,2490,null,null,null,null,null,0,null,null,null,null,0,null,null,2490,null,null,0,2490,null,null,0,0]
["홍길동3",null,null,null,null,1507810,null,null,null,null,"건강",null,45760,null,null,null,null,null,0,null,null,null,null,0,null,null,45760,null,null,0,45760,null,48750,0]
[null,null,null,null,null,null,null,null,null,null,"요양",null,2990,null,null,null,null,null,0,null,null,null,null,0,null,null,2990,null,null,0,2990,null,null,0,0]
["홍길동4",null,null,null,null,1492580,null,null,null,null,"건강",null,45290,null,null,null,null,null,0,null,null,null,null,0,null,null,45290,null,null,0,45290,null,48250,0]
[null,null,null,null,null,null,null,null,null,null,"요양",null,2960,null,null,null,null,null,0,null,null,null,null,0,null,null,2960,null,null,0,2960,null,null,0,0]
["홍길동5",null,null,null,null,0,null,null,null,null,"건강",null,0,null,null,null,null,null,190710,null,null,null,null,0,null,null,190710,null,null,0,190710,null,203250,0]
[null,null,null,null,null,null,null,null,null,null,"요양",null,0,null,null,"퇴직정산 보험료",null,null,12540,null,null,null,null,0,null,null,12540,null,null,0,12540,null,null,0,0]
["홍길동6",null,null,null,null,0,null,null,null,null,"건강",null,0,null,null,null,null,null,81510,null,null,null,null,0,null,null,81510,null,null,0,81510,null,86780,0]
[null,null,null,null,null,null,null,null,null,null,"요양",null,0,null,null,"퇴직정산 보험료",null,null,5270,null,null,null,null,0,null,null,5270,null,null,0,5270,null,null,0,0]
["홍길동7",null,null,null,null,4249914,null,null,null,null,"건강",null,128980,null,null,null,null,null,0,null,null,null,null,0,null,null,128980,null,null,0,128980,null,137420,0]
[null,null,null,null,null,null,null,null,null,null,"요양",null,8440,null,null,null,null,null,0,null,null,null,null,0,null,null,8440,null,null,0,8440,null,null,0,0]
["홍길동8",null,null,null,null,2531829,null,null,null,null,"건강",null,76840,null,null,null,null,null,0,null,null,null,null,0,null,null,76840,null,null,0,76840,null,81870,0]
[null,null,null,null,null,null,null,null,null,null,"요양",null,5030,null,null,null,null,null,0,null,null,null,null,0,null,null,5030,null,null,0,5030,null,null,0,0]
["홍길동9",null,null,null,null,2051016,null,null,null,null,"건강",null,62240,null,null,null,null,null,0,null,null,null,null,0,null,null,62240,null,null,0,62240,null,66310,0]
[null,null,null,null,null,null,null,null,null,null,"요양",null,4070,null,null,null,null,null,0,null,null,null,null,0,null,null,4070,null,null,0,4070,null,null,0,0]
["홍길동10",null,null,null,null,2800000,null,null,null,null,"건강",null,84980,null,null,null,null,null,0,null,null,null,null,0,null,null,84980,null,null,0,84980,null,90540,0]
[null,null,null,null,null,null,null,null,null,null,"요양",null,5560,null,null,null,null,null,0,null,null,null,null,0,null,null,5560,null,null,0,5560,null,null,0,0]
["산출보험료:         575,100 정산(소급)금액:      290,030 연말정산:              0 고지금액:     865,130 환급금이자:           0 고지+이자 금액:     865,130\n페이지       건강:         539,790          건강:      272,220     건강:              0     건강:     812,010      건강:           0          건강:     812,010\n소 계\n요양:          35,310          요양:       17,810     요양:              0     요양:      53,120      요양:           0          요양:      53,120"]
["개인별 보험료 고지(산출)내역서 - 건강보험"]
["작  성  일",null,null,null,null,null,null,"2015년 03월 17일",null,null,null,null,null,null,"사업장관리번호",null,null,null,null,null,null,null,null,null,null,null,null,null,"단위사업장기호",null,null,0]
["통 보 년 월",null,null,null,null,null,null,"2015년 03월 1차",null,null,null,null,null,null,"사 업 장 명"]
["전자납부번호",null,null,null,null,null,null,null,null,null,null,null,null,null,"단위사업장명",null,null,null,null,null,"NONE"]
["성명","증번호",null,null,null,"보수월액",null,null,null,null,"구 분",null,"산출보험료",null,null,"사 유","적용기간",null,"정산금액",null,null,"감 면",null,"연말정산 보 험 료",null,null,"고지금액",null,null,"환급금 이  자","고지+이자 합     계",null,"총  계 (건강+요양)","단위기관"]
[null,"주민등록번호",null,null,null,null,null,null,null,null,null,null,null,null,null,null,null,null,null,null,null,null,null,null,null,null,null,null,null,null,null,null,null,"회계/직종"]
["홍길동11",null,null,null,null,0,null,null,null,null,"건강",null,0,null,null,null,null,null,5140,null,null,null,null,0,null,null,5140,null,null,0,5140,null,5480,0]
[null,null,null,null,null,null,null,null,null,null,"요양",null,0,null,null,"퇴직정산 보험료",null,null,340,null,null,null,null,0,null,null,340,null,null,0,340,null,null,0,0]
["홍길동12",null,null,null,null,2500000,null,null,null,null,"건강",null,75870,null,null,null,null,null,0,null,null,null,null,0,null,null,75870,null,null,0,75870,null,80830,0]
[null,null,null,null,null,null,null,null,null,null,"요양",null,4960,null,null,null,null,null,0,null,null,null,null,0,null,null,4960,null,null,0,4960,null,null,0,0]
["홍길동13",null,null,null,null,2800000,null,null,null,null,"건강",null,84980,null,null,null,null,null,0,null,null,null,null,0,null,null,84980,null,null,0,84980,null,90540,0]
[null,null,null,null,null,null,null,null,null,null,"요양",null,5560,null,null,null,null,null,0,null,null,null,null,0,null,null,5560,null,null,0,5560,null,null,0,0]
["홍길동14",null,null,null,null,1900000,null,null,null,null,"건강",null,57660,null,null,null,null,null,0,null,null,null,null,0,null,null,57660,null,null,0,57660,null,61430,0]
[null,null,null,null,null,null,null,null,null,null,"요양",null,3770,null,null,null,null,null,0,null,null,null,null,0,null,null,3770,null,null,0,3770,null,null,0,0]
["홍길동15",null,null,null,null,3200000,null,null,null,null,"건강",null,97120,null,null,null,null,null,0,null,null,null,null,0,null,null,97120,null,null,0,97120,null,103480,0]
[null,null,null,null,null,null,null,null,null,null,"요양",null,6360,null,null,null,null,null,0,null,null,null,null,0,null,null,6360,null,null,0,6360,null,null,0,0]
["홍길동16",null,null,null,null,0,null,null,null,null,"건강",null,0,null,null,null,null,null,80,null,null,null,null,0,null,null,80,null,null,0,80,null,100,0]
{"$rows_left_out":18}
{"sheet":"Sheet1","index":1,"n_rows":21,"n_cols":3,"rows_kept":21,"cut":false,"hidden":false,"merged":[]}
[null,"건강","요양"]
["홍길동1",{"$f":"SUMIFS('Table 1'!$AE:$AE,'Table 1'!$A:$A,Sheet1!$A2,'Table 1'!$K:$K,Sheet1!B$1)","v":57620},{"$f":"SUMIFS('Table 1'!$AE:$AE,'Table 1'!$A:$A,Sheet1!$A2,'Table 1'!$K:$K,Sheet1!C$1)","v":0}]
["홍길동2",{"$f":"SUMIFS('Table 1'!$AE:$AE,'Table 1'!$A:$A,Sheet1!$A3,'Table 1'!$K:$K,Sheet1!B$1)","v":38080},{"$f":"SUMIFS('Table 1'!$AE:$AE,'Table 1'!$A:$A,Sheet1!$A3,'Table 1'!$K:$K,Sheet1!C$1)","v":0}]
["홍길동3",{"$f":"SUMIFS('Table 1'!$AE:$AE,'Table 1'!$A:$A,Sheet1!$A4,'Table 1'!$K:$K,Sheet1!B$1)","v":45760},{"$f":"SUMIFS('Table 1'!$AE:$AE,'Table 1'!$A:$A,Sheet1!$A4,'Table 1'!$K:$K,Sheet1!C$1)","v":0}]
["홍길동4",{"$f":"SUMIFS('Table 1'!$AE:$AE,'Table 1'!$A:$A,Sheet1!$A5,'Table 1'!$K:$K,Sheet1!B$1)","v":45290},{"$f":"SUMIFS('Table 1'!$AE:$AE,'Table 1'!$A:$A,Sheet1!$A5,'Table 1'!$K:$K,Sheet1!C$1)","v":0}]
["홍길동5",{"$f":"SUMIFS('Table 1'!$AE:$AE,'Table 1'!$A:$A,Sheet1!$A6,'Table 1'!$K:$K,Sheet1!B$1)","v":190710},{"$f":"SUMIFS('Table 1'!$AE:$AE,'Table 1'!$A:$A,Sheet1!$A6,'Table 1'!$K:$K,Sheet1!C$1)","v":0}]
["홍길동6",{"$f":"SUMIFS('Table 1'!$AE:$AE,'Table 1'!$A:$A,Sheet1!$A7,'Table 1'!$K:$K,Sheet1!B$1)","v":81510},{"$f":"SUMIFS('Table 1'!$AE:$AE,'Table 1'!$A:$A,Sheet1!$A7,'Table 1'!$K:$K,Sheet1!C$1)","v":0}]
["홍길동7",{"$f":"SUMIFS('Table 1'!$AE:$AE,'Table 1'!$A:$A,Sheet1!$A8,'Table 1'!$K:$K,Sheet1!B$1)","v":128980},{"$f":"SUMIFS('Table 1'!$AE:$AE,'Table 1'!$A:$A,Sheet1!$A8,'Table 1'!$K:$K,Sheet1!C$1)","v":0}]
["홍길동8",{"$f":"SUMIFS('Table 1'!$AE:$AE,'Table 1'!$A:$A,Sheet1!$A9,'Table 1'!$K:$K,Sheet1!B$1)","v":76840},{"$f":"SUMIFS('Table 1'!$AE:$AE,'Table 1'!$A:$A,Sheet1!$A9,'Table 1'!$K:$K,Sheet1!C$1)","v":0}]
["홍길동9",{"$f":"SUMIFS('Table 1'!$AE:$AE,'Table 1'!$A:$A,Sheet1!$A10,'Table 1'!$K:$K,Sheet1!B$1)","v":62240},{"$f":"SUMIFS('Table 1'!$AE:$AE,'Table 1'!$A:$A,Sheet1!$A10,'Table 1'!$K:$K,Sheet1!C$1)","v":0}]
["홍길동10",{"$f":"SUMIFS('Table 1'!$AE:$AE,'Table 1'!$A:$A,Sheet1!$A11,'Table 1'!$K:$K,Sheet1!B$1)","v":84980},{"$f":"SUMIFS('Table 1'!$AE:$AE,'Table 1'!$A:$A,Sheet1!$A11,'Table 1'!$K:$K,Sheet1!C$1)","v":0}]
["홍길동11",{"$f":"SUMIFS('Table 1'!$AE:$AE,'Table 1'!$A:$A,Sheet1!$A12,'Table 1'!$K:$K,Sheet1!B$1)","v":5140},{"$f":"SUMIFS('Table 1'!$AE:$AE,'Table 1'!$A:$A,Sheet1!$A12,'Table 1'!$K:$K,Sheet1!C$1)","v":0}]
["홍길동12",{"$f":"SUMIFS('Table 1'!$AE:$AE,'Table 1'!$A:$A,Sheet1!$A13,'Table 1'!$K:$K,Sheet1!B$1)","v":75870},{"$f":"SUMIFS('Table 1'!$AE:$AE,'Table 1'!$A:$A,Sheet1!$A13,'Table 1'!$K:$K,Sheet1!C$1)","v":0}]
["홍길동13",{"$f":"SUMIFS('Table 1'!$AE:$AE,'Table 1'!$A:$A,Sheet1!$A14,'Table 1'!$K:$K,Sheet1!B$1)","v":84980},{"$f":"SUMIFS('Table 1'!$AE:$AE,'Table 1'!$A:$A,Sheet1!$A14,'Table 1'!$K:$K,Sheet1!C$1)","v":0}]
["홍길동14",{"$f":"SUMIFS('Table 1'!$AE:$AE,'Table 1'!$A:$A,Sheet1!$A15,'Table 1'!$K:$K,Sheet1!B$1)","v":57660},{"$f":"SUMIFS('Table 1'!$AE:$AE,'Table 1'!$A:$A,Sheet1!$A15,'Table 1'!$K:$K,Sheet1!C$1)","v":0}]
["홍길동15",{"$f":"SUMIFS('Table 1'!$AE:$AE,'Table 1'!$A:$A,Sheet1!$A16,'Table 1'!$K:$K,Sheet1!B$1)","v":97120},{"$f":"SUMIFS('Table 1'!$AE:$AE,'Table 1'!$A:$A,Sheet1!$A16,'Table 1'!$K:$K,Sheet1!C$1)","v":0}]
["홍길동16",{"$f":"SUMIFS('Table 1'!$AE:$AE,'Table 1'!$A:$A,Sheet1!$A17,'Table 1'!$K:$K,Sheet1!B$1)","v":80},{"$f":"SUMIFS('Table 1'!$AE:$AE,'Table 1'!$A:$A,Sheet1!$A17,'Table 1'!$K:$K,Sheet1!C$1)","v":0}]
["홍길동17",{"$f":"SUMIFS('Table 1'!$AE:$AE,'Table 1'!$A:$A,Sheet1!$A18,'Table 1'!$K:$K,Sheet1!B$1)","v":75870},{"$f":"SUMIFS('Table 1'!$AE:$AE,'Table 1'!$A:$A,Sheet1!$A18,'Table 1'!$K:$K,Sheet1!C$1)","v":0}]
["홍길동18",{"$f":"SUMIFS('Table 1'!$AE:$AE,'Table 1'!$A:$A,Sheet1!$A19,'Table 1'!$K:$K,Sheet1!B$1)","v":75870},{"$f":"SUMIFS('Table 1'!$AE:$AE,'Table 1'!$A:$A,Sheet1!$A19,'Table 1'!$K:$K,Sheet1!C$1)","v":0}]
["홍길동19",{"$f":"SUMIFS('Table 1'!$AE:$AE,'Table 1'!$A:$A,Sheet1!$A20,'Table 1'!$K:$K,Sheet1!B$1)","v":100150},{"$f":"SUMIFS('Table 1'!$AE:$AE,'Table 1'!$A:$A,Sheet1!$A20,'Table 1'!$K:$K,Sheet1!C$1)","v":0}]
["홍길동20",{"$f":"SUMIFS('Table 1'!$AE:$AE,'Table 1'!$A:$A,Sheet1!$A21,'Table 1'!$K:$K,Sheet1!B$1)","v":75870},{"$f":"SUMIFS('Table 1'!$AE:$AE,'Table 1'!$A:$A,Sheet1!$A21,'Table 1'!$K:$K,Sheet1!C$1)","v":0}]